Target
Peptidyl-prolyl cis-trans isomerase FKBP1A
Ligand
BDBM50068547
Substrate
Meas. Tech.
ChEMBL_66273 (CHEMBL678143)
Ki
7.5±n/a nM
Citation
 Hamilton, GSSteiner, JP Immunophilins: beyond immunosuppression. J Med Chem 41:5119-43 (1999)  
Target
Name:
Peptidyl-prolyl cis-trans isomerase FKBP1A
Synonyms:
12 kDa FK506-binding protein FK506-binding protein 1A FKB1A_HUMAN FKBP-1A FKBP12 Immunophilin FKBP12 PPIase FKBP1A Rotamase mTOR/FKBP12A/FKBP12B
Type:
Isomerase
Mol. Mass.:
11953.09
Organism:
Homo sapiens (Human)
Description:
P62942
Residue:
108
  
Inhibitor
Name:
BDBM50068547
Synonyms:
1-(3,3-Dimethyl-2-oxo-pentanoyl)-pyrrolidine-2-carboxylic acid 3-pyridin-3-yl-propyl ester | CHEMBL149192
Type:
Small organic molecule
Emp. Form.:
C20H28N2O4
Mol. Mass.:
360.4473
SMILES:
CCC(C)(C)C(=O)C(=O)N1CCCC1C(=O)OCCCc1cccnc1
: