Target
5-hydroxytryptamine receptor 3A/3B
Ligand
BDBM50062450
Substrate
Meas. Tech.
ChEMBL_3163 (CHEMBL617808)
IC50
370±n/a nM
Citation
 Rival, YHoffmann, RDidier, BRybaltchenko, VBourguignon, JJWermuth, CG 5-HT3 antagonists derived from aminopyridazine-type muscarinic M1 agonists. J Med Chem 41:311-7 (1998)  
Target
Name:
5-hydroxytryptamine receptor 3A/3B
Synonyms:
Serotonin 3 (5-HT3) receptor | Serotonin 3a (5-HT3a)/3b (5-HT3b) receptor
Type:
Mol. Mass.:
Description:
ASSAY_ID of EBI is 2974
Components:
This complex has 2 components.
Component 1
Name:
5-hydroxytryptamine receptor 3B
Synonyms:
5HT3B_RAT Serotonin (5-HT) receptor
Type:
PROTEIN
Mol. Mass.:
50328.78
Organism:
Rattus norvegicus
Description:
EBI_11885
Residue:
437
  
Component 2
Name:
5-hydroxytryptamine receptor 3A
Synonyms:
5-HT3 5HT3A_RAT Htr3 Serotonin (5-HT) receptor | Zacopride site-R
Type:
Enzyme Catalytic Domain
Mol. Mass.:
55428.70
Organism:
RAT
Description:
5-HT3 HTR3A RAT::P35563
Residue:
483
  
Inhibitor
Name:
BDBM50062450
Synonyms:
1-(4-Methyl-piperazin-1-yl)-4-phenyl-phthalazine; hydrochloride | CHEMBL543160
Type:
Small organic molecule
Emp. Form.:
C19H20N4
Mol. Mass.:
304.3889
SMILES:
CN1CCN(CC1)c1nnc(-c2ccccc2)c2ccccc12
: