Target
Progesterone receptor
Ligand
BDBM50063096
Substrate
Meas. Tech.
ChEMBL_159377 (CHEMBL768810)
IC50
2200±n/a nM
Citation
 Hamann, LGHiguchi, RIZhi, LEdwards, JPWang, XNMarschke, KBKong, JWFarmer, LJJones, TK Synthesis and biological activity of a novel series of nonsteroidal, peripherally selective androgen receptor antagonists derived from 1,2-dihydropyridono[5,6-g]quinolines. J Med Chem 41:623-39 (1998)  
Target
Name:
Progesterone receptor
Synonyms:
NR3C3 PGR PRGR_HUMAN | progesterone
Type:
Protein
Mol. Mass.:
98979.52
Organism:
Homo sapiens (Human)
Description:
P06401
Residue:
933
  
Inhibitor
Name:
BDBM50063096
Synonyms:
1,8,8,9-Tetramethyl-4-trifluoromethyl-6,7,8,9-tetrahydro-1H-pyrido[3,2-g]quinolin-2-one | CHEMBL435651
Type:
Small organic molecule
Emp. Form.:
C17H19F3N2O
Mol. Mass.:
324.3408
SMILES:
CN1c2cc3n(C)c(=O)cc(c3cc2CCC1(C)C)C(F)(F)F
: