Target
Carbonic anhydrase 1
Ligand
BDBM50079034
Substrate
Meas. Tech.
ChEMBL_47514 (CHEMBL657824)
Ki
18±n/a nM
Citation
 Scozzafava, AMenabuoni, LMincione, FBriganti, FMincione, GSupuran, CT Carbonic anhydrase inhibitors. Synthesis of water-soluble, topically effective, intraocular pressure-lowering aromatic/heterocyclic sulfonamides containing cationic or anionic moieties: is the tail more important than the ring? J Med Chem 42:2641-50 (1999)  
Target
Name:
Carbonic anhydrase 1
Synonyms:
CA-I CAB Carbonate dehydratase I Carbonic anhydrase 1 (CA I) Carbonic anhydrase 1 (Recombinant CA I) Carbonic anhydrase B Carbonic anhydrase I (CA I) Carbonic anhydrase I (CAI) Carbonic anhydrase isoenzyme I (hCA I) | hCA
Type:
Enzyme
Mol. Mass.:
28873.37
Organism:
Homo sapiens (Human)
Description:
P00915
Residue:
261
  
Inhibitor
Name:
BDBM50079034
Synonyms:
6-(2-Sulfamoyl-benzothiazol-6-ylcarbamoyl)-pyridine-2-carboxylic acid | CHEMBL314929
Type:
Small organic molecule
Emp. Form.:
C14H10N4O5S2
Mol. Mass.:
378.383
SMILES:
NS(=O)(=O)c1nc2ccc(NC(=O)c3cccc(n3)C(O)=O)cc2s1
: