Target
Carbonic anhydrase 2
Ligand
BDBM50079063
Substrate
Meas. Tech.
ChEMBL_45078 (CHEMBL657149)
Ki
10±n/a nM
Citation
 Scozzafava, AMenabuoni, LMincione, FBriganti, FMincione, GSupuran, CT Carbonic anhydrase inhibitors. Synthesis of water-soluble, topically effective, intraocular pressure-lowering aromatic/heterocyclic sulfonamides containing cationic or anionic moieties: is the tail more important than the ring? J Med Chem 42:2641-50 (1999)  
Target
Name:
Carbonic anhydrase 2
Synonyms:
CA-II CAC Carbonate dehydratase II Carbonic anhydrase 2 (CA-II) Carbonic anhydrase C Carbonic anhydrase II (CA-II) Carbonic anhydrase II (hCA II) | Carbonic anhydrase isoenzyme II (hCA II)
Type:
Enzyme
Mol. Mass.:
29250.71
Organism:
Homo sapiens (Human)
Description:
P00918
Residue:
260
  
Inhibitor
Name:
BDBM50079063
Synonyms:
6-(2,3-Dichloro-4,6-disulfamoyl-phenylcarbamoyl)-pyridine-2-carboxylic acid CHEMBL89634
Type:
Small organic molecule
Emp. Form.:
C13H10Cl2N4O7S2
Mol. Mass.:
469.277
SMILES:
NS(=O)(=O)c1cc(c(NC(=O)c2cccc(n2)C(O)=O)c(Cl)c1Cl)S(N)(=O)=O
: