Target
Carbonic anhydrase 1
Ligand
BDBM10860
Substrate
Meas. Tech.
ChEMBL_47518 (CHEMBL657828)
Ki
25000±n/a nM
Citation
 Scozzafava, ABriganti, FMincione, GMenabuoni, LMincione, FSupuran, CT Carbonic anhydrase inhibitors: synthesis of water-soluble, aminoacyl/dipeptidyl sulfonamides possessing long-lasting intraocular pressure-lowering properties via the topical route. J Med Chem 42:3690-700 (1999)  
Target
Name:
Carbonic anhydrase 1
Synonyms:
CA-I CAB Carbonate dehydratase I Carbonic anhydrase 1 (CA I) Carbonic anhydrase 1 (Recombinant CA I) Carbonic anhydrase B Carbonic anhydrase I (CA I) Carbonic anhydrase I (CAI) Carbonic anhydrase isoenzyme I (hCA I) | hCA
Type:
Enzyme
Mol. Mass.:
28873.37
Organism:
Homo sapiens (Human)
Description:
P00915
Residue:
261
  
Inhibitor
Name:
BDBM10860
Synonyms:
4-(aminomethyl)benzene-1-sulfonamide MAFENIDE aromatic/heteroaromatic sulfonamide 5 | hCA inhibitor, 9
Type:
Small organic molecule
Emp. Form.:
C7H10N2O2S
Mol. Mass.:
186.232
SMILES:
NCc1ccc(cc1)S(N)(=O)=O
: