Target
Tumor necrosis factor
Ligand
BDBM50081307
Substrate
Meas. Tech.
ChEMBL_212403 (CHEMBL816155)
IC50
>25000±n/a nM
Citation
 Chao, QDeng, LShih, HLeoni, LMGenini, DCarson, DACottam, HB Substituted isoquinolines and quinazolines as potential antiinflammatory agents. Synthesis and biological evaluation of inhibitors of tumor necrosis factor alpha. J Med Chem 42:3860-73 (1999)  
Target
Name:
Tumor necrosis factor
Synonyms:
Cachectin TNF-a TNFA TNFSF2 Tumor necrosis factor (TNFa) Tumor necrosis factor ligand superfamily member 2 Tumor necrosis factor, soluble form | tumor necrosis factor alpha
Type:
Enzyme
Mol. Mass.:
25645.11
Organism:
Homo sapiens (Human)
Description:
P01375
Residue:
233
  
Inhibitor
Name:
BDBM50081307
Synonyms:
4-(2-Dimethylamino-6,7-dimethoxy-quinazolin-4-yloxy)-butyric acid ethyl ester | CHEMBL126806
Type:
Small organic molecule
Emp. Form.:
C18H25N3O5
Mol. Mass.:
363.4082
SMILES:
CCOC(=O)CCCOc1nc(nc2cc(OC)c(OC)cc12)N(C)C
: