Target
Tumor necrosis factor
Ligand
BDBM50048928
Substrate
Meas. Tech.
ChEMBL_212403 (CHEMBL816155)
IC50
3000±n/a nM
Citation
 Chao, QDeng, LShih, HLeoni, LMGenini, DCarson, DACottam, HB Substituted isoquinolines and quinazolines as potential antiinflammatory agents. Synthesis and biological evaluation of inhibitors of tumor necrosis factor alpha. J Med Chem 42:3860-73 (1999)  
Target
Name:
Tumor necrosis factor
Synonyms:
Cachectin TNF-a TNFA TNFSF2 Tumor necrosis factor (TNFa) Tumor necrosis factor ligand superfamily member 2 Tumor necrosis factor, soluble form | tumor necrosis factor alpha
Type:
Enzyme
Mol. Mass.:
25645.11
Organism:
Homo sapiens (Human)
Description:
P01375
Residue:
233
  
Inhibitor
Name:
BDBM50048928
Synonyms:
4-(2,4-Dioxo-1-propyl-1,4-dihydro-2H-pteridin-3-yl)-butyric acid ethyl ester | CHEMBL127042
Type:
Small organic molecule
Emp. Form.:
C15H20N4O4
Mol. Mass.:
320.3437
SMILES:
CCCn1c2nccnc2c(=O)n(CCCC(=O)OCC)c1=O
: