Target
Tumor necrosis factor
Ligand
BDBM50081342
Substrate
Meas. Tech.
ChEMBL_212403 (CHEMBL816155)
IC50
21000±n/a nM
Citation
 Chao, QDeng, LShih, HLeoni, LMGenini, DCarson, DACottam, HB Substituted isoquinolines and quinazolines as potential antiinflammatory agents. Synthesis and biological evaluation of inhibitors of tumor necrosis factor alpha. J Med Chem 42:3860-73 (1999)  
Target
Name:
Tumor necrosis factor
Synonyms:
Cachectin TNF-a TNFA TNFSF2 Tumor necrosis factor (TNFa) Tumor necrosis factor ligand superfamily member 2 Tumor necrosis factor, soluble form | tumor necrosis factor alpha
Type:
Enzyme
Mol. Mass.:
25645.11
Organism:
Homo sapiens (Human)
Description:
P01375
Residue:
233
  
Inhibitor
Name:
BDBM50081342
Synonyms:
5-(6,7-Dimethoxy-1-oxo-1H-isoquinolin-2-yl)-pentanoic acid ethyl ester | CHEMBL127003
Type:
Small organic molecule
Emp. Form.:
C18H23NO5
Mol. Mass.:
333.3789
SMILES:
CCOC(=O)CCCCn1ccc2cc(OC)c(OC)cc2c1=O
: