Target
Alpha-1A adrenergic receptor
Ligand
BDBM50082865
Substrate
Meas. Tech.
ChEMBL_33605 (CHEMBL876765)
Ki
0.40±n/a nM
Citation
 Wong, WCSun, WLagu, BTian, DMarzabadi, MRZhang, FNagarathnam, DMiao, SWWetzel, JMPeng, JForray, CChang, RSChen, TBRansom, RO'Malley, SBroten, TPKling, PVyas, KPZhang, KGluchowski, C Design and synthesis of novel alpha(1)(a) adrenoceptor-selective antagonists. 4. Structure-activity relationship in the dihydropyrimidine series. J Med Chem 42:4804-13 (1999)  
Target
Name:
Alpha-1A adrenergic receptor
Synonyms:
ADA1A_HUMAN ADRA1C Alpha 1A-adrenoceptor Alpha adrenergic receptor 1a Alpha-adrenergic receptor 1c adrenergic Alpha1 | adrenergic Alpha1C
Type:
Cell-surface receptors
Mol. Mass.:
51511.67
Organism:
Homo sapiens (Human)
Description:
P35348
Residue:
466
  
Inhibitor
Name:
BDBM50082865
Synonyms:
6-(3,4-Difluoro-phenyl)-1-[5-(4,4-diphenyl-piperidin-1-yl)-pentyl]-2,4-dimethyl-1,6-dihydro-pyrimidine-5-carboxylic acid methyl ester | CHEMBL145746
Type:
Small organic molecule
Emp. Form.:
C36H41F2N3O2
Mol. Mass.:
585.7264
SMILES:
COC(=O)C1=C(C)N=C(C)N(CCCCCN2CCC(CC2)(c2ccccc2)c2ccccc2)C1c1ccc(F)c(F)c1
: