Target
Alpha-1B adrenergic receptor
Ligand
BDBM50082825
Substrate
Meas. Tech.
ChEMBL_34328 (CHEMBL648111)
Ki
140±n/a nM
Citation
 Wong, WCSun, WLagu, BTian, DMarzabadi, MRZhang, FNagarathnam, DMiao, SWWetzel, JMPeng, JForray, CChang, RSChen, TBRansom, RO'Malley, SBroten, TPKling, PVyas, KPZhang, KGluchowski, C Design and synthesis of novel alpha(1)(a) adrenoceptor-selective antagonists. 4. Structure-activity relationship in the dihydropyrimidine series. J Med Chem 42:4804-13 (1999)  
Target
Name:
Alpha-1B adrenergic receptor
Synonyms:
ADA1B_HUMAN Adrenergic alpha1B Adrenergic receptor alpha Alpha 1B-adrenoreceptor | Alpha-1B adrenergic receptor
Type:
Enzyme
Mol. Mass.:
56862.13
Organism:
Homo sapiens (Human)
Description:
P35368
Residue:
520
  
Inhibitor
Name:
BDBM50082825
Synonyms:
4-(3,4-Difluoro-phenyl)-3-[5-(4-methoxycarbonyl-4-phenyl-piperidin-1-yl)-pentyl]-6-methyl-2-oxo-1,2,3,4-tetrahydro-pyrimidine-5-carboxylic acid methyl ester | CHEMBL142981
Type:
Small organic molecule
Emp. Form.:
C31H37F2N3O5
Mol. Mass.:
569.6394
SMILES:
COC(=O)C1C(N(CCCCCN2CCC(CC2)(C(=O)OC)c2ccccc2)C(=O)N=C1C)c1ccc(F)c(F)c1
: