Target
Alpha-1B adrenergic receptor
Ligand
BDBM50082869
Substrate
Meas. Tech.
ChEMBL_34328 (CHEMBL648111)
Ki
410±n/a nM
Citation
 Wong, WCSun, WLagu, BTian, DMarzabadi, MRZhang, FNagarathnam, DMiao, SWWetzel, JMPeng, JForray, CChang, RSChen, TBRansom, RO'Malley, SBroten, TPKling, PVyas, KPZhang, KGluchowski, C Design and synthesis of novel alpha(1)(a) adrenoceptor-selective antagonists. 4. Structure-activity relationship in the dihydropyrimidine series. J Med Chem 42:4804-13 (1999)  
Target
Name:
Alpha-1B adrenergic receptor
Synonyms:
ADA1B_HUMAN Adrenergic alpha1B Adrenergic receptor alpha Alpha 1B-adrenoreceptor | Alpha-1B adrenergic receptor
Type:
Enzyme
Mol. Mass.:
56862.13
Organism:
Homo sapiens (Human)
Description:
P35368
Residue:
520
  
Inhibitor
Name:
BDBM50082869
Synonyms:
1-{5-[5-Carbamoyl-6-(2,4-difluoro-phenyl)-2,4-dimethyl-6H-pyrimidin-1-yl]-pentyl}-4-phenyl-piperidine-4-carboxylic acid methyl ester | CHEMBL145353
Type:
Small organic molecule
Emp. Form.:
C31H38F2N4O3
Mol. Mass.:
552.6552
SMILES:
COC(=O)C1(CCN(CCCCCN2C(C(C(N)=O)=C(C)N=C2C)c2ccc(F)cc2F)CC1)c1ccccc1
: