Target
5-hydroxytryptamine receptor 4
Ligand
BDBM50083185
Substrate
Meas. Tech.
ChEMBL_3345 (CHEMBL619045)
Ki
440±n/a nM
Citation
 López-Rodríguez, MLBenhamú, BMorcillo, MJTejada, IDOrensanz, LAlfaro, MJMartín, MI Benzimidazole derivatives. 2. Synthesis and structure-activity relationships of new azabicyclic benzimidazole-4-carboxylic acid derivatives with affinity for serotoninergic 5-HT(3) receptors. J Med Chem 42:5020-8 (2000)  
Target
Name:
5-hydroxytryptamine receptor 4
Synonyms:
5-HT-4 5-HT4L 5-hydroxytryptamine receptor 4 Htr4 Serotonin 4 (5-HT4) receptor
Type:
Enzyme Catalytic Domain
Mol. Mass.:
46117.31
Organism:
RAT
Description:
5-HT4 HTR4 RAT::Q62758
Residue:
406
  
Inhibitor
Name:
BDBM50083185
Synonyms:
6-Chloro-1H-benzoimidazole-4-carboxylic acid 1-aza-bicyclo[2.2.2]oct-3-yl ester | CHEMBL416172
Type:
Small organic molecule
Emp. Form.:
C15H16ClN3O2
Mol. Mass.:
305.759
SMILES:
Clc1cc(C(=O)OC2CN3CCC2CC3)c2nc[nH]c2c1
: