Target
5-hydroxytryptamine receptor 3A/3B
Ligand
BDBM50083189
Substrate
Meas. Tech.
ChEMBL_2986 (CHEMBL621503)
Ki
83±n/a nM
Citation
 López-Rodríguez, MLBenhamú, BMorcillo, MJTejada, IDOrensanz, LAlfaro, MJMartín, MI Benzimidazole derivatives. 2. Synthesis and structure-activity relationships of new azabicyclic benzimidazole-4-carboxylic acid derivatives with affinity for serotoninergic 5-HT(3) receptors. J Med Chem 42:5020-8 (2000)  
Target
Name:
5-hydroxytryptamine receptor 3A/3B
Synonyms:
Serotonin 3 (5-HT3) receptor | Serotonin 3a (5-HT3a)/3b (5-HT3b) receptor
Type:
Mol. Mass.:
Description:
ASSAY_ID of EBI is 2974
Components:
This complex has 2 components.
Component 1
Name:
5-hydroxytryptamine receptor 3B
Synonyms:
5HT3B_RAT Serotonin (5-HT) receptor
Type:
PROTEIN
Mol. Mass.:
50328.78
Organism:
Rattus norvegicus
Description:
EBI_11885
Residue:
437
  
Component 2
Name:
5-hydroxytryptamine receptor 3A
Synonyms:
5-HT3 5HT3A_RAT Htr3 Serotonin (5-HT) receptor | Zacopride site-R
Type:
Enzyme Catalytic Domain
Mol. Mass.:
55428.70
Organism:
RAT
Description:
5-HT3 HTR3A RAT::P35563
Residue:
483
  
Inhibitor
Name:
BDBM50083189
Synonyms:
6-Chloro-1H-benzoimidazole-4-carboxylic acid (9-methyl-9-aza-bicyclo[3.3.1]non-3-yl)-amide | CHEMBL19022
Type:
Small organic molecule
Emp. Form.:
C17H21ClN4O
Mol. Mass.:
332.828
SMILES:
CN1C2CCCC1CC(C2)NC(=O)c1cc(Cl)cc2nc[nH]c12
: