Target
D(4) dopamine receptor
Ligand
BDBM50083338
Substrate
Meas. Tech.
ChEMBL_63106 (CHEMBL674499)
Ki
4.3±n/a nM
Citation
 Belliotti, TRWustrow, DJBrink, WAZoski, KTShih, YHWhetzel, SZGeorgic, LMCorbin, AEAkunne, HCHeffner, TGPugsley, TAWise, LD A series of 6- and 7-piperazinyl- and -piperidinylmethylbenzoxazinones with dopamine D4 antagonist activity: discovery of a potential atypical antipsychotic agent. J Med Chem 42:5181-7 (2000)  
Target
Name:
D(4) dopamine receptor
Synonyms:
D(2C) dopamine receptor DOPAMINE D4.2 DRD4 Dopamine D4 receptor
Type:
Enzyme
Mol. Mass.:
48373.19
Organism:
Homo sapiens (Human)
Description:
P21917
Residue:
419
  
Inhibitor
Name:
BDBM50083338
Synonyms:
6-(4-p-Tolyl-piperazin-1-ylmethyl)-4H-benzo[1,4]oxazin-3-one | CHEMBL345552
Type:
Small organic molecule
Emp. Form.:
C20H23N3O2
Mol. Mass.:
337.4155
SMILES:
Cc1ccc(cc1)N1CCN(Cc2ccc3OCC(=O)Nc3c2)CC1
: