Target
Adenosine receptor A1
Ligand
BDBM21220
Substrate
Meas. Tech.
ChEMBL_29474 (CHEMBL640467)
Ki
63±n/a nM
Citation
 de Zwart, MKourounakis, AKooijman, HSpek, ALLink, Rvon Frijtag Drabbe Künzel, JKIJzerman, AP 5'-N-substituted carboxamidoadenosines as agonists for adenosine receptors. J Med Chem 42:1384-92 (1999)  
Target
Name:
Adenosine receptor A1
Synonyms:
AA1R_RAT ADENOSINE A1 high Adenosine A1 receptor (A1) Adenosine receptors A1 | Adora1
Type:
Protein
Mol. Mass.:
36704.13
Organism:
Rattus norvegicus (rat)
Description:
Residue:
326
  
Inhibitor
Name:
BDBM21220
Synonyms:
(2S,3S,4R,5R)-5-(6-amino-9H-purin-9-yl)-N-ethyl-3,4-dihydroxyoxolane-2-carboxamide Adenosine, N6-Ethyl-carboxamido CHEMBL464859 NECA
Type:
Antineoplastic Agent
Emp. Form.:
C12H16N6O4
Mol. Mass.:
308.2932
SMILES:
CCNC(=O)[C@H]1O[C@H]([C@H](O)[C@@H]1O)n1cnc2c(N)ncnc12
: