Target
Similar to alpha-tubulin isoform 1/Tubulin beta-2B chain
Ligand
BDBM50060957
Substrate
Meas. Tech.
ChEMBL_211317 (CHEMBL818977)
IC50
1400±n/a nM
Citation
 Wang, ZYang, DMohanakrishnan, AKFanwick, PENampoothiri, PHamel, ECushman, M Synthesis of B-ring homologated estradiol analogues that modulate tubulin polymerization and microtubule stability. J Med Chem 43:2419-29 (2000)  
Target
Name:
Similar to alpha-tubulin isoform 1/Tubulin beta-2B chain
Synonyms:
Tubulin | Tubulin alpha chain /beta chain
Type:
Mol. Mass.:
Description:
ASSAY_ID of EBI is 51441
Components:
This complex has 2 components.
Component 1
Name:
Tubulin beta-2B chain
Synonyms:
TBB2B_BOVIN Tubulin | Tubulin beta chain
Type:
PROTEIN
Mol. Mass.:
49932.38
Organism:
Bos taurus
Description:
ChEMBL_211651
Residue:
445
  
Component 2
Name:
Similar to alpha-tubulin isoform 1
Synonyms:
Tubulin
Type:
PROTEIN
Mol. Mass.:
9422.48
Organism:
Bos taurus
Description:
EBI_18002
Residue:
84
  
Inhibitor
Name:
BDBM50060957
Synonyms:
2-Hydroxyestradol 2-methyl ether CHEMBL299613 | Panzem
Type:
Small organic molecule
Emp. Form.:
C19H26O3
Mol. Mass.:
302.4079
SMILES:
COc1cc2[C@H]3CC[C@]4(C)[C@@H](O)CC[C@H]4[C@@H]3CCc2cc1O
: