Target
D(4) dopamine receptor
Ligand
BDBM50090828
Substrate
Meas. Tech.
ChEMBL_60821 (CHEMBL872784)
Ki
18±n/a nM
Citation
 van Vliet, LARodenhuis, NDijkstra, DWikström, HPugsley, TASerpa, KAMeltzer, LTHeffner, TGWise, LDLajiness, MEHuff, RMSvensson, KSundell, SLundmark, M Synthesis and pharmacological evaluation of thiopyran analogues of the dopamine D3 receptor-selective agonist (4aR,10bR)-(+)-trans-3,4,4a,10b-tetrahydro-4-n-propyl-2H,5H [1]b enzopyrano[4,3-b]-1,4-oxazin-9-ol (PD 128907). J Med Chem 43:2871-82 (2000)  
Target
Name:
D(4) dopamine receptor
Synonyms:
D(2C) dopamine receptor DOPAMINE D4.2 DRD4 Dopamine D4 receptor
Type:
Enzyme
Mol. Mass.:
48373.19
Organism:
Homo sapiens (Human)
Description:
P21917
Residue:
419
  
Inhibitor
Name:
BDBM50090828
Synonyms:
(-)-1-Propyl-2,3,10,10a-tetrahydro-1H,4aH-4-oxa-9-thia-1-aza-phenanthren-6-ol | CHEMBL98305
Type:
Small organic molecule
Emp. Form.:
C14H19NO2S
Mol. Mass.:
265.371
SMILES:
CCCN1CCO[C@H]2[C@H]1CSc1ccc(O)cc21
: