Target
D(2) dopamine receptor
Ligand
BDBM50091032
Substrate
Meas. Tech.
ChEMBL_61937 (CHEMBL675125)
Kd
17000±n/a nM
Citation
 Wilcox, REHuang, WHBrusniak, MYWilcox, DMPearlman, RSTeeter, MMDuRand, CJWiens, BLNeve, KA CoMFA-based prediction of agonist affinities at recombinant wild type versus serine to alanine point mutated D2 dopamine receptors. J Med Chem 43:3005-19 (2000)  
Target
Name:
D(2) dopamine receptor
Synonyms:
DOPAMINE D2 DOPAMINE D2 Short Dopamine D2 receptor Drd2
Type:
G Protein-Coupled Receptor (GPCR)
Mol. Mass.:
50931.60
Organism:
Rattus norvegicus (rat)
Description:
P61169
Residue:
444
  
Inhibitor
Name:
BDBM50091032
Synonyms:
6,7-Dihydroxy-1,2,3,4-tetrahydro-naphthalen-2-yl-ammonium(R(+)ADTN) | Aminotetralin-6,7-dihydroxy-(+)
Type:
Small organic molecule
Emp. Form.:
C10H14NO2
Mol. Mass.:
180.2231
SMILES:
[NH3+][C@@H]1CCc2cc(O)c(O)cc2C1
: