Target
D(2) dopamine receptor
Ligand
BDBM50091035
Substrate
Meas. Tech.
ChEMBL_62064 (CHEMBL670838)
Kd
88000±n/a nM
Citation
 Wilcox, REHuang, WHBrusniak, MYWilcox, DMPearlman, RSTeeter, MMDuRand, CJWiens, BLNeve, KA CoMFA-based prediction of agonist affinities at recombinant wild type versus serine to alanine point mutated D2 dopamine receptors. J Med Chem 43:3005-19 (2000)  
Target
Name:
D(2) dopamine receptor
Synonyms:
DOPAMINE D2 DOPAMINE D2 Short Dopamine D2 receptor Drd2
Type:
G Protein-Coupled Receptor (GPCR)
Mol. Mass.:
50931.60
Organism:
Rattus norvegicus (rat)
Description:
P61169
Residue:
444
  
Inhibitor
Name:
BDBM50091035
Synonyms:
2-(4-Hydroxy-3-methoxy-phenyl)-ethyl-ammonium(3-methoxytyramine) | 3-O-methyldopamine
Type:
Small organic molecule
Emp. Form.:
C9H14NO2
Mol. Mass.:
168.2124
SMILES:
COc1cc(CC[NH3+])ccc1O
: