Target
D(2) dopamine receptor
Ligand
BDBM50054067
Substrate
Meas. Tech.
ChEMBL_62072 (CHEMBL672372)
Kd
400±n/a nM
Citation
 Wilcox, REHuang, WHBrusniak, MYWilcox, DMPearlman, RSTeeter, MMDuRand, CJWiens, BLNeve, KA CoMFA-based prediction of agonist affinities at recombinant wild type versus serine to alanine point mutated D2 dopamine receptors. J Med Chem 43:3005-19 (2000)  
Target
Name:
D(2) dopamine receptor
Synonyms:
DOPAMINE D2 DOPAMINE D2 Short Dopamine D2 receptor Drd2
Type:
G Protein-Coupled Receptor (GPCR)
Mol. Mass.:
50931.60
Organism:
Rattus norvegicus (rat)
Description:
P61169
Residue:
444
  
Inhibitor
Name:
BDBM50054067
Synonyms:
(2R)-7-Dipropylamino-5,6,7,8-tetrahydro-naphthalen-2-ol (R)-7-(dipropylamino)-5,6,7,8-tetrahydronaphthalen-2-ol (R)-7-Dipropylamino-5,6,7,8-tetrahydro-naphthalen-2-ol.HCl CHEMBL301559
Type:
Small organic molecule
Emp. Form.:
C16H25NO
Mol. Mass.:
247.3758
SMILES:
CCCN(CCC)[C@@H]1CCc2ccc(O)cc2C1
: