Target
D(2) dopamine receptor
Ligand
BDBM50067726
Substrate
Meas. Tech.
ChEMBL_62072 (CHEMBL672372)
Kd
3000±n/a nM
Citation
 Wilcox, REHuang, WHBrusniak, MYWilcox, DMPearlman, RSTeeter, MMDuRand, CJWiens, BLNeve, KA CoMFA-based prediction of agonist affinities at recombinant wild type versus serine to alanine point mutated D2 dopamine receptors. J Med Chem 43:3005-19 (2000)  
Target
Name:
D(2) dopamine receptor
Synonyms:
DOPAMINE D2 DOPAMINE D2 Short Dopamine D2 receptor Drd2
Type:
G Protein-Coupled Receptor (GPCR)
Mol. Mass.:
50931.60
Organism:
Rattus norvegicus (rat)
Description:
P61169
Residue:
444
  
Inhibitor
Name:
BDBM50067726
Synonyms:
(R)-6-Chloro-7,8-dihydroxy-1-phenyl-2,3,4,5-tetrahydro-1H-benzo[d]azepinium SKF 81297
Type:
Small organic molecule
Emp. Form.:
C16H17ClNO2
Mol. Mass.:
290.764
SMILES:
Oc1cc2[C@H](C[NH2+]CCc2c(Cl)c1O)c1ccccc1
: