Target
D(2) dopamine receptor
Ligand
BDBM50032516
Substrate
Meas. Tech.
ChEMBL_62063 (CHEMBL670837)
Kd
1300±n/a nM
Citation
 Wilcox, REHuang, WHBrusniak, MYWilcox, DMPearlman, RSTeeter, MMDuRand, CJWiens, BLNeve, KA CoMFA-based prediction of agonist affinities at recombinant wild type versus serine to alanine point mutated D2 dopamine receptors. J Med Chem 43:3005-19 (2000)  
Target
Name:
D(2) dopamine receptor
Synonyms:
DOPAMINE D2 DOPAMINE D2 Short Dopamine D2 receptor Drd2
Type:
G Protein-Coupled Receptor (GPCR)
Mol. Mass.:
50931.60
Organism:
Rattus norvegicus (rat)
Description:
P61169
Residue:
444
  
Inhibitor
Name:
BDBM50032516
Synonyms:
(6aR,12bS)-4-Methyl-6-propyl-5,6,6a,7,8,12b-hexahydro-benzo[a]phenanthridine-10,11-diol CHEMBL104141
Type:
Small organic molecule
Emp. Form.:
C21H25NO2
Mol. Mass.:
323.4287
SMILES:
CCCN1Cc2c(C)cccc2[C@H]2[C@H]1CCc1cc(O)c(O)cc21
: