Target
D(2) dopamine receptor
Ligand
BDBM50010686
Substrate
Meas. Tech.
ChEMBL_62064 (CHEMBL670838)
Kd
2500±n/a nM
Citation
 Wilcox, REHuang, WHBrusniak, MYWilcox, DMPearlman, RSTeeter, MMDuRand, CJWiens, BLNeve, KA CoMFA-based prediction of agonist affinities at recombinant wild type versus serine to alanine point mutated D2 dopamine receptors. J Med Chem 43:3005-19 (2000)  
Target
Name:
D(2) dopamine receptor
Synonyms:
DOPAMINE D2 DOPAMINE D2 Short Dopamine D2 receptor Drd2
Type:
G Protein-Coupled Receptor (GPCR)
Mol. Mass.:
50931.60
Organism:
Rattus norvegicus (rat)
Description:
P61169
Residue:
444
  
Inhibitor
Name:
BDBM50010686
Synonyms:
(6aR,12bS)-10,11-Dihydroxy-5,6,6a,7,8,12b-hexahydro-benzo[a]phenanthridinium 10,11-Dihydroxy-5,6,6a,7,8,12b-hexahydro-benzo[a]phenanthridinium(DHX) CHEMBL25856 | dihydrexidine
Type:
Small organic molecule
Emp. Form.:
C17H17NO2
Mol. Mass.:
267.3224
SMILES:
Oc1cc2CC[C@H]3NCc4ccccc4[C@@H]3c2cc1O
: