Target
72 kDa type IV collagenase
Ligand
BDBM50084304
Substrate
Meas. Tech.
ChEMBL_104367 (CHEMBL715828)
IC50
4±n/a nM
Citation
 O'Brien, PMOrtwine, DFPavlovsky, AGPicard, JASliskovic, DRRoth, BDDyer, RDJohnson, LLMan, CFHallak, H Structure-activity relationships and pharmacokinetic analysis for a series of potent, systemically available biphenylsulfonamide matrix metalloproteinase inhibitors. J Med Chem 43:156-66 (2000)  
Target
Name:
72 kDa type IV collagenase
Synonyms:
72 kDa gelatinase CLG4A Gelatinase A (MMP-2) MMP2_HUMAN Matrix metalloproteinase-2 (MMP 2) Matrix metalloproteinases 2 (MMP-2) | TBE-1
Type:
Enzyme
Mol. Mass.:
73870.36
Organism:
Homo sapiens (Human)
Description:
P08253
Residue:
660
  
Inhibitor
Name:
BDBM50084304
Synonyms:
(4'-Bromo-biphenyl-4-sulfonylamino)-acetic acid | CHEMBL44898
Type:
Small organic molecule
Emp. Form.:
C14H12BrNO4S
Mol. Mass.:
370.218
SMILES:
OC(=O)CNS(=O)(=O)c1ccc(cc1)-c1ccc(Br)cc1
: