Target
Collagenase 3
Ligand
BDBM8485
Substrate
Meas. Tech.
ChEMBL_106476 (CHEMBL719145)
IC50
2±n/a nM
Citation
 O'Brien, PMOrtwine, DFPavlovsky, AGPicard, JASliskovic, DRRoth, BDDyer, RDJohnson, LLMan, CFHallak, H Structure-activity relationships and pharmacokinetic analysis for a series of potent, systemically available biphenylsulfonamide matrix metalloproteinase inhibitors. J Med Chem 43:156-66 (2000)  
Target
Name:
Collagenase 3
Synonyms:
MMP-13 MMP13_HUMAN Matrix metalloproteinase-13 (MMP-13) | Matrix metalloproteinase-13 (MMP13)
Type:
Enzyme
Mol. Mass.:
53808.06
Organism:
Homo sapiens (Human)
Description:
P45452
Residue:
471
  
Inhibitor
Name:
BDBM8485
Synonyms:
(2R)-N-hydroxy-3-methyl-2-[(4-phenoxybenzene)sulfonamido]butanamide hydroxamate analogue (R)-4 | hydroxamate analogue 22
Type:
Small organic molecule
Emp. Form.:
C17H20N2O5S
Mol. Mass.:
364.416
SMILES:
CC(C)[C@@H](NS(=O)(=O)c1ccc(Oc2ccccc2)cc1)C(=O)NO
: