Target
Adenosine receptor A2a
Ligand
BDBM50084445
Substrate
Meas. Tech.
ChEMBL_29992 (CHEMBL642180)
Ki
4870±n/a nM
Citation
 Vittori, SLorenzen, AStannek, CCostanzi, SVolpini, RIJzerman, APKunzel, JKCristalli, G N-cycloalkyl derivatives of adenosine and 1-deazaadenosine as agonists and partial agonists of the A(1) adenosine receptor. J Med Chem 43:250-60 (2000)  
Target
Name:
Adenosine receptor A2a
Synonyms:
AA2AR_RAT Adenosine A2 receptor Adenosine Receptors A2a (A2a) Adenosine receptors A2a Rat striatal adenosine A2a receptor
Type:
G Protein-Coupled Receptor (GPCR)
Mol. Mass.:
45015.65
Organism:
Rattus norvegicus (rat)
Description:
Rat A2A receptors expressed in CHO cells.
Residue:
410
  
Inhibitor
Name:
BDBM50084445
Synonyms:
2-(5-Chloro-7-cycloheptylamino-imidazo[4,5-b]pyridin-3-yl)-5-hydroxymethyl-tetrahydro-furan-3,4-diol | CHEMBL312981
Type:
Small organic molecule
Emp. Form.:
C18H25ClN4O4
Mol. Mass.:
396.869
SMILES:
OC[C@H]1O[C@H]([C@@H](O)C1O)n1cnc2c(NC3CCCCCC3)cc(Cl)nc12
: