Target
Adenosine receptor A1
Ligand
BDBM50369625
Substrate
Meas. Tech.
ChEMBL_29143 (CHEMBL637714)
Ki
769±n/a nM
Citation
 Vittori, SLorenzen, AStannek, CCostanzi, SVolpini, RIJzerman, APKunzel, JKCristalli, G N-cycloalkyl derivatives of adenosine and 1-deazaadenosine as agonists and partial agonists of the A(1) adenosine receptor. J Med Chem 43:250-60 (2000)  
Target
Name:
Adenosine receptor A1
Synonyms:
AA1R_RAT ADENOSINE A1 high Adenosine A1 receptor (A1) Adenosine receptors A1 | Adora1
Type:
Protein
Mol. Mass.:
36704.13
Organism:
Rattus norvegicus (rat)
Description:
Residue:
326
  
Inhibitor
Name:
BDBM50369625
Synonyms:
CHEMBL1790715
Type:
Small organic molecule
Emp. Form.:
C17H25N5O3
Mol. Mass.:
347.4121
SMILES:
OC[C@H]1O[C@H](C[C@@H]1O)n1cnc2c(NC3CCCCCC3)ncnc12
: