Target
Adenosine receptor A1
Ligand
BDBM50084445
Substrate
Meas. Tech.
ChEMBL_222333 (CHEMBL823612)
EC50
6580±n/a nM
Citation
 Vittori, SLorenzen, AStannek, CCostanzi, SVolpini, RIJzerman, APKunzel, JKCristalli, G N-cycloalkyl derivatives of adenosine and 1-deazaadenosine as agonists and partial agonists of the A(1) adenosine receptor. J Med Chem 43:250-60 (2000)  
Target
Name:
Adenosine receptor A1
Synonyms:
AA1R_RAT ADENOSINE A1 high Adenosine A1 receptor (A1) Adenosine receptors A1 | Adora1
Type:
Protein
Mol. Mass.:
36704.13
Organism:
Rattus norvegicus (rat)
Description:
Residue:
326
  
Inhibitor
Name:
BDBM50084445
Synonyms:
2-(5-Chloro-7-cycloheptylamino-imidazo[4,5-b]pyridin-3-yl)-5-hydroxymethyl-tetrahydro-furan-3,4-diol | CHEMBL312981
Type:
Small organic molecule
Emp. Form.:
C18H25ClN4O4
Mol. Mass.:
396.869
SMILES:
OC[C@H]1O[C@H]([C@@H](O)C1O)n1cnc2c(NC3CCCCCC3)cc(Cl)nc12
: