Target
3-oxo-5-alpha-steroid 4-dehydrogenase 1
Ligand
BDBM50092485
Substrate
Meas. Tech.
ChEMBL_205186 (CHEMBL811334)
Ki
2.7±n/a nM
Citation
 Guarna, AMachetti, FOcchiato, EGScarpi, DComerci, ADanza, GMancina, RSerio, MHardy, K Benzo[c]quinolizin-3-ones: a novel class of potent and selective nonsteroidal inhibitors of human steroid 5alpha-reductase 1. J Med Chem 43:3718-35 (2000)  
Target
Name:
3-oxo-5-alpha-steroid 4-dehydrogenase 1
Synonyms:
3-oxo-5-alpha-steroid 4-dehydrogenase 1 S5A1_HUMAN SR type 1 Steroid 5-alpha-reductase | Steroid 5-alpha-reductase 1
Type:
Enzyme
Mol. Mass.:
29472.80
Organism:
Homo sapiens (Human)
Description:
P18405
Residue:
259
  
Inhibitor
Name:
BDBM50092485
Synonyms:
4-methyl-8-chloro-1,2,5,6-tetrahydro pyrido[1,2-a]quinolin-3-one CHEMBL118446
Type:
Small organic molecule
Emp. Form.:
C14H14ClNO
Mol. Mass.:
247.72
SMILES:
CC1=C2CCc3cc(Cl)ccc3N2CCC1=O
: