Target
Substance-P receptor
Ligand
BDBM50409026
Substrate
Meas. Tech.
ChEMBL_222920 (CHEMBL842694)
IC50
9600±n/a nM
Citation
 Liu, JUnderwood, DJCascieri, MARohrer, SPCantin, LDChicchi, GSmith, ABHirschmann, R Synthesis of a substance P antagonist with a somatostatin scaffold: factors affecting agonism/antagonism at GPCRs and the role of pseudosymmetry. J Med Chem 43:3827-31 (2000)  
Target
Name:
Substance-P receptor
Synonyms:
NK-1 receptor NK1 Receptor NK1R_HUMAN Neurokinin-1 (NK-1) SPR TACR1 Tachykinin receptor 1 (NK1) | tachykinin
Type:
G Protein-Coupled Receptor (GPCR)
Mol. Mass.:
46254.43
Organism:
Homo sapiens (Human)
Description:
P25103
Residue:
407
  
Inhibitor
Name:
BDBM50409026
Synonyms:
CHEMBL2112245
Type:
Small organic molecule
Emp. Form.:
C74H92FN15O17S2
Mol. Mass.:
1546.741
SMILES:
C[C@@H](O)[C@@H]1NC(=O)[C@H](Cc2ccccc2)NC(=O)[C@@H](NC(=O)[C@H](Cc2ccc(F)cc2)NC(=O)[C@@H](Cc2c[nH]c3ccccc23)NC(=O)[C@H](Cc2ccccc2)NC(=O)[C@H](Cc2ccccc2)NC(=O)[C@H](CC(N)=O)NC(=O)[C@H](CCCCN)NC(=O)[C@@H](N)CSSC[C@@H](NC(=O)[C@H](CO)NC1=O)C(O)=O)[C@@H](C)O
: