Target
Thymidylate synthase
Ligand
BDBM18796
Substrate
Meas. Tech.
ChEMBL_209619 (CHEMBL816736)
IC50
110000±n/a nM
Citation
 Gangjee, AYu, JMcGuire, JJCody, VGalitsky, NKisliuk, RLQueener, SF Design, synthesis, and X-ray crystal structure of a potent dual inhibitor of thymidylate synthase and dihydrofolate reductase as an antitumor agent. J Med Chem 43:3837-51 (2000)  
Target
Name:
Thymidylate synthase
Synonyms:
TS TYMS Thymidylate synthase (TS) | Thymidylate synthase/GAR transformylase/AICAR transformylase
Type:
Enzyme
Mol. Mass.:
35718.07
Organism:
Homo sapiens (Human)
Description:
Residue:
313
  
Inhibitor
Name:
BDBM18796
Synonyms:
(2S)-2-{[4-(2-{2-amino-4-oxo-1H,4H,7H-pyrrolo[2,3-d]pyrimidin-5-yl}ethyl)phenyl]formamido}pentanedioic acid Pemetrexed
Type:
Small organic molecule
Emp. Form.:
C20H21N5O6
Mol. Mass.:
427.4106
SMILES:
Nc1nc2[nH]cc(CCc3ccc(cc3)C(=O)N[C@@H](CCC(O)=O)C(O)=O)c2c(=O)[nH]1
: