Target
Cyclin-dependent kinase 5
Ligand
BDBM7521
Substrate
Meas. Tech.
ChEMBL_51306 (CHEMBL884356)
IC50
2000±n/a nM
Citation
 Ducrot, PLegraverend, MGrierson, DS 3D-QSAR CoMFA on cyclin-dependent kinase inhibitors. J Med Chem 43:4098-108 (2000)  
Target
Name:
Cyclin-dependent kinase 5
Synonyms:
CDK5 CDKN5 Cyclin-dependent kinase 5 (CDK5/ p25) Cyclin-dependent-like kinase 5 PSSALRE Tau protein kinase II catalytic subunit
Type:
Enzyme Subunit
Mol. Mass.:
33308.61
Organism:
Homo sapiens (Human)
Description:
Residue:
292
  
Inhibitor
Name:
BDBM7521
Synonyms:
(2S)-2-{[6-(benzylamino)-9-(propan-2-yl)-9H-purin-2-yl]amino}-3-phenylpropan-1-ol | 2,6,9-Trisubstituted purine deriv. 16
Type:
Small organic molecule
Emp. Form.:
C24H28N6O
Mol. Mass.:
416.5187
SMILES:
CC(C)n1cnc2c(NCc3ccccc3)nc(N[C@H](CO)Cc3ccccc3)nc12
: