Target
Cyclin-dependent kinase 1
Ligand
BDBM7521
Substrate
Meas. Tech.
ChEMBL_50320 (CHEMBL660789)
IC50
7300±n/a nM
Citation
 Ducrot, PLegraverend, MGrierson, DS 3D-QSAR CoMFA on cyclin-dependent kinase inhibitors. J Med Chem 43:4098-108 (2000)  
Target
Name:
Cyclin-dependent kinase 1
Synonyms:
CDC2 CDK1 CDKN1 Cell division protein kinase 1 P34CDC2 | p34 protein kinase
Type:
Enzyme Subunit
Mol. Mass.:
34101.08
Organism:
Homo sapiens (Human)
Description:
P06493
Residue:
297
  
Inhibitor
Name:
BDBM7521
Synonyms:
(2S)-2-{[6-(benzylamino)-9-(propan-2-yl)-9H-purin-2-yl]amino}-3-phenylpropan-1-ol | 2,6,9-Trisubstituted purine deriv. 16
Type:
Small organic molecule
Emp. Form.:
C24H28N6O
Mol. Mass.:
416.5187
SMILES:
CC(C)n1cnc2c(NCc3ccccc3)nc(N[C@H](CO)Cc3ccccc3)nc12
: