Target
Carbonic anhydrase 2
Ligand
BDBM50094393
Substrate
Meas. Tech.
ChEMBL_45236 (CHEMBL657194)
Ki
0.3±n/a nM
Citation
 Scozzafava, AMenabuoni, LMincione, FBriganti, FMincione, GSupuran, CT Carbonic anhydrase inhibitors: perfluoroalkyl/aryl-substituted derivatives of aromatic/heterocyclic sulfonamides as topical intraocular pressure-lowering agents with prolonged duration of action. J Med Chem 43:4542-51 (2000)  
Target
Name:
Carbonic anhydrase 2
Synonyms:
CA-II CAC Carbonate dehydratase II Carbonic anhydrase 2 (CA-II) Carbonic anhydrase C Carbonic anhydrase II (CA-II) Carbonic anhydrase II (hCA II) | Carbonic anhydrase isoenzyme II (hCA II)
Type:
Enzyme
Mol. Mass.:
29250.71
Organism:
Homo sapiens (Human)
Description:
P00918
Residue:
260
  
Inhibitor
Name:
BDBM50094393
Synonyms:
4-Methyl-5-pentafluorobenzenesulfonylimino-4,5-dihydro-[1,3,4]thiadiazole-2-sulfonic acid amide | CHEMBL138253
Type:
Small organic molecule
Emp. Form.:
C9H5F5N4O4S3
Mol. Mass.:
424.347
SMILES:
Cn1nc(sc1=NS(=O)(=O)c1c(F)c(F)c(F)c(F)c1F)S(N)(=O)=O
: