Target
Carbonic anhydrase 2
Ligand
BDBM50094441
Substrate
Meas. Tech.
ChEMBL_45236 (CHEMBL657194)
Ki
0.3±n/a nM
Citation
 Scozzafava, AMenabuoni, LMincione, FBriganti, FMincione, GSupuran, CT Carbonic anhydrase inhibitors: perfluoroalkyl/aryl-substituted derivatives of aromatic/heterocyclic sulfonamides as topical intraocular pressure-lowering agents with prolonged duration of action. J Med Chem 43:4542-51 (2000)  
Target
Name:
Carbonic anhydrase 2
Synonyms:
CA-II CAC Carbonate dehydratase II Carbonic anhydrase 2 (CA-II) Carbonic anhydrase C Carbonic anhydrase II (CA-II) Carbonic anhydrase II (hCA II) | Carbonic anhydrase isoenzyme II (hCA II)
Type:
Enzyme
Mol. Mass.:
29250.71
Organism:
Homo sapiens (Human)
Description:
P00918
Residue:
260
  
Inhibitor
Name:
BDBM50094441
Synonyms:
2,3,4,5,6-Pentafluoro-benzenesulfonic acid 2-sulfamoyl-benzothiazol-6-yl ester | CHEMBL142132
Type:
Small organic molecule
Emp. Form.:
C13H5F5N2O5S3
Mol. Mass.:
460.376
SMILES:
NS(=O)(=O)c1nc2ccc(OS(=O)(=O)c3c(F)c(F)c(F)c(F)c3F)cc2s1
: