Target
Histone deacetylase
Ligand
BDBM50366736
Substrate
Meas. Tech.
ChEMBL_87390 (CHEMBL691505)
IC50
11±n/a nM
Citation
 Meinke, PTColletti, SLDoss, GMyers, RWGurnett, AMDulski, PMDarkin-Rattray, SJAllocco, JJGaluska, SSchmatz, DMWyvratt, MJFisher, MH Synthesis of apicidin-derived quinolone derivatives: parasite-selective histone deacetylase inhibitors and antiproliferative agents. J Med Chem 43:4919-22 (2000)  
Target
Name:
Histone deacetylase
Synonyms:
Type:
PROTEIN
Mol. Mass.:
48692.87
Organism:
Cryptosporidium parvum
Description:
ChEMBL_87390
Residue:
432
  
Inhibitor
Name:
BDBM50366736
Synonyms:
CHEMBL1793972
Type:
Small organic molecule
Emp. Form.:
C35H49N5O6
Mol. Mass.:
635.7935
SMILES:
CC[C@H](C)[C@@H]1NC(=O)[C@@H](NC(=O)[C@H](CCCCCC(=O)CC)NC(=O)[C@H]2CCCCN2C1=O)c1cn(CC)c2ccccc2c1=O
: