Target
Renin
Ligand
BDBM50077669
Substrate
Meas. Tech.
ChEMBL_36513 (CHEMBL650008)
Ki
0.7±n/a nM
Citation
 Leung, DAbbenante, GFairlie, DP Protease inhibitors: current status and future prospects. J Med Chem 43:305-41 (2000)  
Target
Name:
Renin
Synonyms:
Angiotensinogenase RENI_HUMAN
Type:
Enzyme
Mol. Mass.:
45058.99
Organism:
Homo sapiens (Human)
Description:
Residue:
406
  
Inhibitor
Name:
BDBM50077669
Synonyms:
(S)-2-Benzyl-N-[(S)-1-((1S,2R,3S)-1-cyclohexylmethyl-3-cyclopropyl-2,3-dihydroxy-propylcarbamoyl)-2-(1H-imidazol-4-yl)-ethyl]-3-(2-methyl-propane-2-sulfonyl)-propionamide CHEMBL31601 REMIKIREN
Type:
Small organic molecule
Emp. Form.:
C33H50N4O6S
Mol. Mass.:
630.838
SMILES:
CC(C)(C)S(=O)(=O)C[C@@H](Cc1ccccc1)C(=O)N[C@@H](Cc1cnc[nH]1)C(=O)N[C@@H](CC1CCCCC1)[C@@H](O)[C@@H](O)C1CC1
: