Target
Interstitial collagenase
Ligand
BDBM50074024
Substrate
Meas. Tech.
ChEMBL_106140 (CHEMBL718687)
Ki
2000±n/a nM
Citation
 Leung, DAbbenante, GFairlie, DP Protease inhibitors: current status and future prospects. J Med Chem 43:305-41 (2000)  
Target
Name:
Interstitial collagenase
Synonyms:
CLG MMP1 Matrix metalloproteinase-1 | Matrix metalloproteinase-1 (MMP-1)
Type:
Enzyme
Mol. Mass.:
54010.26
Organism:
Homo sapiens (Human)
Description:
P03956
Residue:
469
  
Inhibitor
Name:
BDBM50074024
Synonyms:
(2S,3R)-3-(4-Methoxy-benzenesulfonyl)-2-methyl-7-phenyl-heptanoic acid hydroxyamide CHEMBL114116
Type:
Small organic molecule
Emp. Form.:
C21H27NO5S
Mol. Mass.:
405.508
SMILES:
COc1ccc(cc1)S(=O)(=O)[C@H](CCCCc1ccccc1)[C@@H](C)C(=O)NO
: