Target
Stromelysin-1
Ligand
BDBM50074024
Substrate
Meas. Tech.
ChEMBL_104750 (CHEMBL715875)
Ki
500±n/a nM
Citation
 Leung, DAbbenante, GFairlie, DP Protease inhibitors: current status and future prospects. J Med Chem 43:305-41 (2000)  
Target
Name:
Stromelysin-1
Synonyms:
MMP-3 MMP3_HUMAN Matrix metalloproteinase 3 Matrix metalloproteinase-3 (MMP-3) SL-1 Stromelysin 1 | Transin-1
Type:
Enzyme
Mol. Mass.:
53973.13
Organism:
Homo sapiens (Human)
Description:
P08254
Residue:
477
  
Inhibitor
Name:
BDBM50074024
Synonyms:
(2S,3R)-3-(4-Methoxy-benzenesulfonyl)-2-methyl-7-phenyl-heptanoic acid hydroxyamide CHEMBL114116
Type:
Small organic molecule
Emp. Form.:
C21H27NO5S
Mol. Mass.:
405.508
SMILES:
COc1ccc(cc1)S(=O)(=O)[C@H](CCCCc1ccccc1)[C@@H](C)C(=O)NO
: