Target
72 kDa type IV collagenase
Ligand
BDBM50074024
Substrate
Meas. Tech.
ChEMBL_104534 (CHEMBL718311)
Ki
10±n/a nM
Citation
 Leung, DAbbenante, GFairlie, DP Protease inhibitors: current status and future prospects. J Med Chem 43:305-41 (2000)  
Target
Name:
72 kDa type IV collagenase
Synonyms:
72 kDa gelatinase CLG4A Gelatinase A (MMP-2) MMP2_HUMAN Matrix metalloproteinase-2 (MMP 2) Matrix metalloproteinases 2 (MMP-2) | TBE-1
Type:
Enzyme
Mol. Mass.:
73870.36
Organism:
Homo sapiens (Human)
Description:
P08253
Residue:
660
  
Inhibitor
Name:
BDBM50074024
Synonyms:
(2S,3R)-3-(4-Methoxy-benzenesulfonyl)-2-methyl-7-phenyl-heptanoic acid hydroxyamide CHEMBL114116
Type:
Small organic molecule
Emp. Form.:
C21H27NO5S
Mol. Mass.:
405.508
SMILES:
COc1ccc(cc1)S(=O)(=O)[C@H](CCCCc1ccccc1)[C@@H](C)C(=O)NO
: