Target
Tripeptidyl-peptidase 2
Ligand
BDBM50085082
Substrate
Meas. Tech.
ChEMBL_211948 (CHEMBL816538)
Ki
57000±n/a nM
Citation
 Ganellin, CRBishop, PBBambal, RBChan, SMLaw, JKMarabout, BLuthra, PMMoore, ANPeschard, OBourgeat, PRose, CVargas, FSchwartz, JC Inhibitors of tripeptidyl peptidase II. 2. Generation of the first novel lead inhibitor of cholecystokinin-8-inactivating peptidase: a strategy for the design of peptidase inhibitors. J Med Chem 43:664-74 (2000)  
Target
Name:
Tripeptidyl-peptidase 2
Synonyms:
TPP2_RAT Tripeptidyl aminopeptidase
Type:
PROTEIN
Mol. Mass.:
138287.08
Organism:
Rattus norvegicus
Description:
ChEMBL_211948
Residue:
1249
  
Inhibitor
Name:
BDBM50085082
Synonyms:
2-Amino-N-(1-butylcarbamoyl-2-cyclohexyl-ethyl)-3-methyl-butyramide (COOH)2.(0.5H2O) | CHEMBL161861
Type:
Small organic molecule
Emp. Form.:
C18H35N3O2
Mol. Mass.:
325.4894
SMILES:
CCCCNC(=O)C(CC1CCCCC1)NC(=O)C(N)C(C)C
: