Target
Tripeptidyl-peptidase 2
Ligand
BDBM50085090
Substrate
Meas. Tech.
ChEMBL_211947 (CHEMBL816537)
Ki
650000±n/a nM
Citation
 Ganellin, CRBishop, PBBambal, RBChan, SMLaw, JKMarabout, BLuthra, PMMoore, ANPeschard, OBourgeat, PRose, CVargas, FSchwartz, JC Inhibitors of tripeptidyl peptidase II. 2. Generation of the first novel lead inhibitor of cholecystokinin-8-inactivating peptidase: a strategy for the design of peptidase inhibitors. J Med Chem 43:664-74 (2000)  
Target
Name:
Tripeptidyl-peptidase 2
Synonyms:
TPP2_RAT Tripeptidyl aminopeptidase
Type:
PROTEIN
Mol. Mass.:
138287.08
Organism:
Rattus norvegicus
Description:
ChEMBL_211948
Residue:
1249
  
Inhibitor
Name:
BDBM50085090
Synonyms:
2-(2-Amino-acetylamino)-3-(1H-indol-3-yl)-propionic acid | CHEMBL158927
Type:
Small organic molecule
Emp. Form.:
C13H15N3O3
Mol. Mass.:
261.2765
SMILES:
NCC(=O)NC(Cc1c[nH]c2ccccc12)C(O)=O
: