Target
Tripeptidyl-peptidase 2
Ligand
BDBM50085091
Substrate
Meas. Tech.
ChEMBL_211948 (CHEMBL816538)
Ki
2100000±n/a nM
Citation
 Ganellin, CRBishop, PBBambal, RBChan, SMLaw, JKMarabout, BLuthra, PMMoore, ANPeschard, OBourgeat, PRose, CVargas, FSchwartz, JC Inhibitors of tripeptidyl peptidase II. 2. Generation of the first novel lead inhibitor of cholecystokinin-8-inactivating peptidase: a strategy for the design of peptidase inhibitors. J Med Chem 43:664-74 (2000)  
Target
Name:
Tripeptidyl-peptidase 2
Synonyms:
TPP2_RAT Tripeptidyl aminopeptidase
Type:
PROTEIN
Mol. Mass.:
138287.08
Organism:
Rattus norvegicus
Description:
ChEMBL_211948
Residue:
1249
  
Inhibitor
Name:
BDBM50085091
Synonyms:
2-Amino-N-(1-hydroxymethyl-2-phenyl-ethyl)-3-methyl-butyramide | CHEMBL161367
Type:
Small organic molecule
Emp. Form.:
C14H22N2O2
Mol. Mass.:
250.3367
SMILES:
CC(C)[C@H](N)C(=O)NC(CO)Cc1ccccc1
: