Target
Tripeptidyl-peptidase 2
Ligand
BDBM50085097
Substrate
Meas. Tech.
ChEMBL_211948 (CHEMBL816538)
Ki
210000±n/a nM
Citation
 Ganellin, CRBishop, PBBambal, RBChan, SMLaw, JKMarabout, BLuthra, PMMoore, ANPeschard, OBourgeat, PRose, CVargas, FSchwartz, JC Inhibitors of tripeptidyl peptidase II. 2. Generation of the first novel lead inhibitor of cholecystokinin-8-inactivating peptidase: a strategy for the design of peptidase inhibitors. J Med Chem 43:664-74 (2000)  
Target
Name:
Tripeptidyl-peptidase 2
Synonyms:
TPP2_RAT Tripeptidyl aminopeptidase
Type:
PROTEIN
Mol. Mass.:
138287.08
Organism:
Rattus norvegicus
Description:
ChEMBL_211948
Residue:
1249
  
Inhibitor
Name:
BDBM50085097
Synonyms:
2-(2-Amino-3-methyl-butyrylamino)-3-(4-benzyloxy-phenyl)-propionic acid (1.75H2O) | CHEMBL157814
Type:
Small organic molecule
Emp. Form.:
C21H26N2O4
Mol. Mass.:
370.4421
SMILES:
CC(C)C(N)C(=O)NC(Cc1ccc(OCc2ccccc2)cc1)C(O)=O
: