Target
Tripeptidyl-peptidase 2
Ligand
BDBM50085108
Substrate
Meas. Tech.
ChEMBL_211948 (CHEMBL816538)
Ki
>3000000±n/a nM
Citation
 Ganellin, CRBishop, PBBambal, RBChan, SMLaw, JKMarabout, BLuthra, PMMoore, ANPeschard, OBourgeat, PRose, CVargas, FSchwartz, JC Inhibitors of tripeptidyl peptidase II. 2. Generation of the first novel lead inhibitor of cholecystokinin-8-inactivating peptidase: a strategy for the design of peptidase inhibitors. J Med Chem 43:664-74 (2000)  
Target
Name:
Tripeptidyl-peptidase 2
Synonyms:
TPP2_RAT Tripeptidyl aminopeptidase
Type:
PROTEIN
Mol. Mass.:
138287.08
Organism:
Rattus norvegicus
Description:
ChEMBL_211948
Residue:
1249
  
Inhibitor
Name:
BDBM50085108
Synonyms:
CHEMBL161844 | [1-(1-Butyl-2-oxo-hexylcarbamoyl)-2-methyl-propyl]-carbamic acid benzyl ester
Type:
Small organic molecule
Emp. Form.:
C23H36N2O5
Mol. Mass.:
420.5423
SMILES:
CCCCOC(=O)C(CCCC)NC(=O)C(NC(=O)OCc1ccccc1)C(C)C
: