Target
Tripeptidyl-peptidase 2
Ligand
BDBM50085112
Substrate
Meas. Tech.
ChEMBL_211948 (CHEMBL816538)
Ki
>3000000±n/a nM
Citation
 Ganellin, CRBishop, PBBambal, RBChan, SMLaw, JKMarabout, BLuthra, PMMoore, ANPeschard, OBourgeat, PRose, CVargas, FSchwartz, JC Inhibitors of tripeptidyl peptidase II. 2. Generation of the first novel lead inhibitor of cholecystokinin-8-inactivating peptidase: a strategy for the design of peptidase inhibitors. J Med Chem 43:664-74 (2000)  
Target
Name:
Tripeptidyl-peptidase 2
Synonyms:
TPP2_RAT Tripeptidyl aminopeptidase
Type:
PROTEIN
Mol. Mass.:
138287.08
Organism:
Rattus norvegicus
Description:
ChEMBL_211948
Residue:
1249
  
Inhibitor
Name:
BDBM50085112
Synonyms:
2-Benzylamino-hexanoic acid (1-methylcarbamoyl-pentyl)-amide (0.25H2O) | CHEMBL159086
Type:
Small organic molecule
Emp. Form.:
C20H33N3O2
Mol. Mass.:
347.4949
SMILES:
CCCCC(NCc1ccccc1)C(=O)NC(CCCC)C(=O)NC
: