Target
Tripeptidyl-peptidase 2
Ligand
BDBM50085114
Substrate
Meas. Tech.
ChEMBL_211948 (CHEMBL816538)
Ki
66000±n/a nM
Citation
 Ganellin, CRBishop, PBBambal, RBChan, SMLaw, JKMarabout, BLuthra, PMMoore, ANPeschard, OBourgeat, PRose, CVargas, FSchwartz, JC Inhibitors of tripeptidyl peptidase II. 2. Generation of the first novel lead inhibitor of cholecystokinin-8-inactivating peptidase: a strategy for the design of peptidase inhibitors. J Med Chem 43:664-74 (2000)  
Target
Name:
Tripeptidyl-peptidase 2
Synonyms:
TPP2_RAT Tripeptidyl aminopeptidase
Type:
PROTEIN
Mol. Mass.:
138287.08
Organism:
Rattus norvegicus
Description:
ChEMBL_211948
Residue:
1249
  
Inhibitor
Name:
BDBM50085114
Synonyms:
2-(2-Amino-3-methyl-butyrylamino)-hexanoic acid methylamide(0.25H2O) | CHEMBL161843
Type:
Small organic molecule
Emp. Form.:
C12H25N3O2
Mol. Mass.:
243.3458
SMILES:
CCCCC(NC(=O)C(N)C(C)C)C(=O)NC
: