Target
Tripeptidyl-peptidase 2
Ligand
BDBM50085119
Substrate
Meas. Tech.
ChEMBL_211948 (CHEMBL816538)
Ki
2000000±n/a nM
Citation
 Ganellin, CRBishop, PBBambal, RBChan, SMLaw, JKMarabout, BLuthra, PMMoore, ANPeschard, OBourgeat, PRose, CVargas, FSchwartz, JC Inhibitors of tripeptidyl peptidase II. 2. Generation of the first novel lead inhibitor of cholecystokinin-8-inactivating peptidase: a strategy for the design of peptidase inhibitors. J Med Chem 43:664-74 (2000)  
Target
Name:
Tripeptidyl-peptidase 2
Synonyms:
TPP2_RAT Tripeptidyl aminopeptidase
Type:
PROTEIN
Mol. Mass.:
138287.08
Organism:
Rattus norvegicus
Description:
ChEMBL_211948
Residue:
1249
  
Inhibitor
Name:
BDBM50085119
Synonyms:
2-(2-Amino-3-methyl-butyrylamino)-4-methylsulfanyl-butyric acid | CHEMBL158097
Type:
Small organic molecule
Emp. Form.:
C10H20N2O3S
Mol. Mass.:
248.342
SMILES:
CSCCC(NC(=O)C(N)C(C)C)C(O)=O
: