Target
Tripeptidyl-peptidase 2
Ligand
BDBM50085120
Substrate
Meas. Tech.
ChEMBL_211948 (CHEMBL816538)
Ki
>500000±n/a nM
Citation
 Ganellin, CRBishop, PBBambal, RBChan, SMLaw, JKMarabout, BLuthra, PMMoore, ANPeschard, OBourgeat, PRose, CVargas, FSchwartz, JC Inhibitors of tripeptidyl peptidase II. 2. Generation of the first novel lead inhibitor of cholecystokinin-8-inactivating peptidase: a strategy for the design of peptidase inhibitors. J Med Chem 43:664-74 (2000)  
Target
Name:
Tripeptidyl-peptidase 2
Synonyms:
TPP2_RAT Tripeptidyl aminopeptidase
Type:
PROTEIN
Mol. Mass.:
138287.08
Organism:
Rattus norvegicus
Description:
ChEMBL_211948
Residue:
1249
  
Inhibitor
Name:
BDBM50085120
Synonyms:
2-(2-Acetylamino-3-methyl-butyrylamino)-pentanoic acid | CHEMBL161201
Type:
Small organic molecule
Emp. Form.:
C12H22N2O4
Mol. Mass.:
258.3141
SMILES:
CCCC(NC(=O)C(NC(C)=O)C(C)C)C(O)=O
: